{"text_format":"1","workbook":"xlsx","n_sheets":2,"sheets":["Form","Data"],"not_rendered":{"charts":0,"images":0,"macros":1,"external_links":0,"defined_names":35,"comments":0,"pivot_tables":0},"unopened":[],"bounds":{"document_bytes":16777216,"sheet_cells":100000,"rows_first":2000,"rows_last":500,"rows_between":2000,"halvings":0,"cell_chars":16384,"cell_head_chars":4096},"cells_cut":0,"cells_raw":0,"read":"whole","date_system":"1900"}

{"sheet":"Form","index":0,"n_rows":112,"n_cols":38,"rows_kept":112,"cut":false,"hidden":false,"merged":[[93,27,93,28],[91,29,91,30],[92,23,92,24],[92,29,92,30],[75,23,75,24],[75,25,75,26],[75,29,75,30],[74,23,74,24],[74,25,74,26],[85,25,85,26],[85,23,85,24],[78,27,78,28],[78,29,78,30],[80,23,80,24],[80,25,80,26],[80,27,80,28],[80,29,80,30],[79,27,79,28],[79,23,79,24],[79,25,79,26],[81,29,81,30],[86,23,86,24],[77,23,77,24],[89,29,89,30],[22,15,22,19],[22,20,22,28],[96,29,96,30],[87,23,87,24],[87,25,87,26],[87,27,87,28],[87,29,87,30],[96,1,96,26],[88,29,88,30],[85,1,85,22],[86,1,86,22],[87,1,87,22],[88,23,88,24],[88,25,88,26],[88,27,88,28],[93,29,93,30],[95,27,95,28],[95,29,95,30],[93,1,93,22],[95,1,95,26],[93,23,93,24],[86,25,86,26],[85,27,85,28],[85,29,85,30],[11,27,11,28],[11,29,11,30],[12,23,12,24],[12,25,12,26],[12,27,12,28],[12,29,12,30],[74,29,74,30],[74,1,74,2],[74,3,74,22],[15,26,15,27],[50,6,50,7],[50,26,50,27],[47,25,49,30],[26,12,26,16],[40,6,40,14],[40,19,40,27],[42,6,42,8],[42,19,42,21],[36,6,36,14],[36,19,36,27],[38,6,38,8],[15,29,15,30],[20,20,20,21],[73,29,73,30],[28,6,28,8],[76,1,76,2],[76,3,76,22],[76,23,76,24],[76,25,76,26],[74,27,74,28],[76,27,76,28],[76,29,76,30],[75,27,75,28],[75,1,75,2],[75,3,75,22],[38,19,38,21],[32,6,32,14],[73,23,73,24],[73,25,73,26],[72,29,72,30],[72,27,72,28],[72,25,72,26],[72,23,72,24],[73,27,73,28],[30,16,30,27],[90,23,90,24],[90,25,90,26],[90,27,90,28],[90,29,90,30],[78,3,78,22],[79,29,79,30],[77,29,77,30],[32,19,32,27],[77,27,77,28],[34,6,34,8],[79,3,79,22],[80,3,80,22],[86,27,86,28],[86,29,86,30],[0,1,0,31],[106,6,106,8],[107,6,107,8],[68,1,68,4],[65,1,65,4],[66,1,67,4],[66,5,67,31],[65,5,65,31],[68,5,68,31],[100,1,100,22],[100,23,100,24],[100,25,100,26],[100,27,100,28],[100,29,100,30],[101,27,101,28],[101,29,101,30],[11,23,11,24],[11,25,11,26],[94,29,94,30],[12,1,12,22],[88,4,88,22],[89,4,89,22],[2,3,2,9],[2,14,2,22],[11,1,11,22],[26,4,26,5],[26,6,26,7],[18,18,18,21],[73,1,73,2],[73,3,73,22],[72,1,72,2],[72,3,72,22],[49,6,49,7],[50,17,50,18],[49,17,49,18],[47,4,47,8],[47,14,47,21],[61,16,61,18],[22,6,22,13],[18,4,18,13],[20,6,20,13],[30,6,30,14],[59,6,59,12],[16,4,16,13],[16,18,16,28],[18,26,18,28],[20,23,20,24],[19,23,19,24],[92,27,92,28],[96,27,96,28],[56,16,56,17],[56,18,56,24],[55,18,55,24],[78,23,78,24],[78,25,78,26],[91,1,91,22],[92,1,92,22],[91,23,91,24],[91,25,91,26],[91,27,91,28],[55,6,55,12],[81,27,81,28],[94,1,94,26],[94,27,94,28],[77,1,77,2],[77,3,77,22],[80,1,80,2],[88,1,90,3],[89,23,89,24],[89,25,89,26],[89,27,89,28],[79,1,79,2],[101,21,101,26],[101,15,101,19],[90,4,90,22],[77,25,77,26],[81,1,81,26],[78,1,78,2],[111,20,111,23],[111,13,111,16],[104,11,104,16],[104,18,104,23],[105,13,105,16],[106,13,106,16],[107,13,107,16],[108,13,108,16],[109,13,109,16],[110,13,110,16],[106,20,106,23],[107,20,107,23],[108,20,108,23],[109,20,109,23],[110,20,110,23],[105,18,105,23],[92,25,92,26],[93,25,93,26]]}
[null,"University of Copenhagen - Form for claiming reimbursement of travel expenses and assessment fee 2024\nYellow fields are compulsory - fill out the white fields when applicable"]
[null,"Your contact at the University of Copenhagen"]
[null,"Name",null,"Lilian Rasmussen",null,null,null,null,null,null,null,null,"E-mail",null,"innovation@sund.ku.dk"]
[]
[null,null,null,null,null,null,null,null,null,null,null,null,null,null,null,null,null,null,null,null,null,null,null,null,null,null,null,null,null,null,null,null,null,null,"TD-penge"]
[null,null,null,null,null,null,null,null,null,null,null,null,null,null,null,null,null,null,null,null,null,null,null,null,null,null,null,null,null,null,null,null,null,null,{"$f":"IF(I5=\"Yes\",1,2)","v":2}]
[]
[null,"Would you like to add an assessment fee?"]
[]
[]
[null,"Assessment fee"]
[null,"Type",null,null,null,null,null,null,null,null,null,null,null,null,null,null,null,null,null,null,null,null,null,"Currency",null,"Amount",null,"DKK"]
[null,null,null,null,null,null,null,null,null,null,null,null,null,null,null,null,null,null,null,null,null,null,null,"*",null,null,null,{"$f":"IF(X13=\"*\",0,((Z13*AI13)/100))","v":0},null,null,null,null,null,null,{"$f":"VLOOKUP(X13,Valutakurser,3,FALSE)","v":"Kurs"}]
[]
[]
[null,"Personal details"]
[null,"First name(s)",null,null,null,null,null,null,null,null,null,null,null,null,null,"Last name",null,null,null,null,null,null,null,null,null,null,null,null,null,null,null,null,null,null,null,"IBAN length"]
[]
[null,"Address",null,null,null,null,null,null,null,null,null,null,null,null,null,"Town/city",null,null,null,null,null,null,null,"Postal code",null,null,null,null,null,null,null,null,null,null,null,{"$f":"IF(AND(E21<>\"*\",E23=\"*\"),VLOOKUP(E21,Data!A:E,5,FALSE),VLOOKUP(E23,Data!A:E,5,FALSE))","v":"IBAN length"}]
[null,null,null,null,null,null,null,null,null,null,null,null,null,null,null,null,null,null,"day","month","year",null,null,"last 4 cpr"]
[null,"Country",null,null,"*",null,{"$f":"IF(ISBLANK(E21),0,VLOOKUP(E21,Data!A:E,2,FALSE))","v":"Country Name"},null,null,null,null,null,null,null,null,"Date of birth",null,null,"*","*","*",null,"-",null,null,null,null,null,null,null,null,null,null,null,"Bank Category",{"$f":"IFERROR(IF(E21=\"*\",0,IF(AND(E21<>\"*\",E23=\"*\"),VLOOKUP(E21,Data!A:E,4,FALSE),VLOOKUP(E23,Data!A:E,4,FALSE))),0)","v":0}]
[]
[null,"Bank location",null,null,"*",null,{"$f":"IF(ISBLANK(E23),0,VLOOKUP(E23,Data!A:E,2,FALSE))","v":"Country Name"},null,null,null,null,null,null,null,null,null,null,null,null,null,null,null,null,null,null,null,null,null,null,null,null,null,null,null,{"$f":"IF(E21=\"*\",0,IF(AND(E21<>\"*\",E23=\"*\"),VLOOKUP(E21,Data!A:E,1,FALSE),VLOOKUP(E23,Data!A:E,1,FALSE)))","v":0},{"$f":"IF(E21=\"*\",0,IF(AND(E21<>\"*\",E23=\"*\"),VLOOKUP(E21,Data!A:E,2,FALSE),VLOOKUP(E23,Data!A:E,2,FALSE)))","v":0}]
[]
[]
[null,"Bank details",null,null,null,null,null,null,null,null,null,null,null,null,null,null,null,null,null,null,null,null,null,null,null,null,null,null,null,null,null,null,null,null,"Bank cat",{"$f":"IFERROR(IF(E21=\"*\",0,IF(AND(E21<>\"*\",E23=\"*\"),VLOOKUP(E21,Data!A:E,4,FALSE),VLOOKUP(E23,Data!A:E,4,FALSE))),0)","v":0}]
[null,"Bank info",null,null,"Reg. number",null,null,null,null,"Account number"]
[]
[null,"Bank info",null,null,"SWIFT"]
[]
[null,null,null,null,"IBAN",null,null,null,null,null,null,null,null,null,null,null,{"$f":"IF(AJ19=0,0,CONCATENATE(\"IBAN numbers in \",AJ23,\"have \",AJ19,\" characters\"))","v":"IBAN numbers in 0have IBAN length characters"}]
[]
[null,"Bank info",null,null,"Bank name",null,null,null,null,null,null,null,null,null,null,null,"Account number"]
[]
[null,null,null,null,"SWIFT"]
[]
[null,"Bank info",null,null,"Bank name",null,null,null,null,null,null,null,null,null,null,null,"Account number"]
[]
[null,null,null,null,"SWIFT",null,null,null,null,null,null,null,null,null,null,null,"Routing number"]
[]
[null,"Bank info",null,null,"Bank name",null,null,null,null,null,null,null,null,null,null,null,"Account number"]
[]
[null,null,null,null,"SWIFT",null,null,null,null,null,null,null,null,null,null,null,"BSB code"]
[]
[]
[null,"Trip details"]
[]
[null,"Destination",null,null,null,null,null,null,null,null,"Country",null,"*",null,{"$f":"IF(ISBLANK(M48),0,VLOOKUP(M48,Data!A:E,2,FALSE))","v":"Country Name"},null,null,null,null,null,null,null,null,"Purpose",null,"School of Health Innovation: Course 3 June, 2024.",null,null,null,null,null,null,null,null,null,{"$f":"M48","v":"*"}]
[]
[null,null,null,null,"day","month","year",null,null,"hours","mins",null,null,null,null,"day","month","year",null,null,"hour","mins",null,null,null,null,null,null,null,null,null,null,null,null,null,null,null,"Trip duration"]
[null,"Departure time",null,null,"*","*","*",null," ","*","*",null,"Return time",null,null,"*","*","*",null,null,"*","*",null,"Trip duration",null,null,{"$f":"IF(V51=\"*\",0,AL51)","v":0},null,"days",null,null,null,null,null,{"$f":"CONCATENATE(E51,\"-\",F51,\"-\",G51,I51,J51,\":\",K51)","v":"*-*-* *:*"},null,{"$f":"CONCATENATE(P51,\"-\",Q51,\"-\",R51,T51,\" \",U51,\":\",V51)","v":"*-*-* *:*"},{"$f":"IF(AK51-AI51>=0,AK51-AI51,0)","v":{"$error":"#VALUE!"}}]
[]
[]
[null,"Deductions and additions"]
[null,null,null,null,null,null,null,null,null,null,null,null,null,"number",null,null,"Transportation in your own car",null,null,null,null,null,null,null,null,"km"]
[null,null,null,null,null,null,"Days with undeclared accommodation",null,null,null,null,null,null,null,null,null,"From/to"]
[null,null,null,null,null,null,null,null,null,null,null,null,null,null,null,null,"From/to"]
[null,null,null,null,null,null,null,null,null,null,null,null,null,null,null,null,null,null,null,null,null,null,null,null,null,{"$f":"SUM(Z56:Z57)","v":0}]
[null,null,null,null,null,null,null,null,null,null,null,null,null,"number",null,null,"Free meals (for trips longer than 24 hours)"]
[null,null,null,null,null,null,"Travel days at your own expense",null,null,null,null,null,null,null,null,null,"Breakfast"]
[null,null,null,null,null,null,null,null,null,null,null,null,null,null,null,null,"Lunch"]
[null,null,null,null,null,null,null,null,null,null,null,null,null,null,null,null,"Dinner"]
[]
[]
[null,"Entertainment expenses"]
[null,"Occasion"]
[null,"Participants"]
[]
[null,"Other information"]
[]
[]
[null,"Expenses"]
[null,"Receipt no.",null,"Description/text",null,null,null,null,null,null,null,null,null,null,null,null,null,null,null,null,null,null,null,"Currency",null,"Amount",null,"DKK",null,{"$f":"IF(E21=\"*\",0,VLOOKUP(AI23,Data!A:E,3,FALSE))","v":0},null,null,null,null,"DKK"]
[null,null,null,null,null,null,null,null,null,null,null,null,null,null,null,null,null,null,null,null,null,null,null,"*",null,null,null,{"$f":"IF(X74=\"*\",0,((Z74*AI74)/100))","v":0},null,{"$f":"IF($E$21=\"*\",0,AB74/(VLOOKUP($AD$73,Valutakurser,3,FALSE))*100)","v":0},null,null,null,null,{"$f":"VLOOKUP(X74,Valutakurser,3,FALSE)","v":"Kurs"}]
[null,null,null,null,null,null,null,null,null,null,null,null,null,null,null,null,null,null,null,null,null,null,null,"*",null,null,null,{"$f":"IF(X75=\"*\",0,((Z75*AI75)/100))","v":0},null,0,null,null,null,null,{"$f":"VLOOKUP(X75,Valutakurser,3,FALSE)","v":"Kurs"}]
[null,null,null,null,null,null,null,null,null,null,null,null,null,null,null,null,null,null,null,null,null,null,null,"*",null,null,null,0,null,0,null,null,null,null,"Kurs"]
[null,null,null,null,null,null,null,null,null,null,null,null,null,null,null,null,null,null,null,null,null,null,null,"*",null,null,null,0,null,0,null,null,null,null,"Kurs"]
[null,null,null,null,null,null,null,null,null,null,null,null,null,null,null,null,null,null,null,null,null,null,null,"*",null,null,null,0,null,0,null,null,null,null,"Kurs"]
[null,null,null,null,null,null,null,null,null,null,null,null,null,null,null,null,null,null,null,null,null,null,null,"*",null,null,null,0,null,0,null,null,null,null,"Kurs"]
[null,null,null,null,null,null,null,null,null,null,null,null,null,null,null,null,null,null,null,null,null,null,null,"*",null,null,null,0,null,0,null,null,null,null,"Kurs"]
[null,null,null,null,null,null,null,null,null,null,null,null,null,null,null,null,null,null,null,null,null,null,null,"*",null,null,null,0,null,0,null,null,null,null,"Kurs"]
[null,"Subtotal",null,null,null,null,null,null,null,null,null,null,null,null,null,null,null,null,null,null,null,null,null,null,null,null,null,{"$f":"SUM(AB74:AC81)","v":0},null,{"$f":"SUM(AD74:AE81)","v":0}]
[]
[]
[null,"Balance"]
[null,"Type",null,null,null,null,null,null,null,null,null,null,null,null,null,null,null,null,null,null,null,null,null,"Number",null,"Rate (DKK)",null,"DKK",null,{"$f":"IF(E21=\"*\",0,VLOOKUP(AI23,Data!A:E,3,FALSE))","v":0}]
[null,"Per diem",null,null,null,null,null,null,null,null,null,null,null,null,null,null,null,null,null,null,null,null,null,{"$f":"IF(AI6<>1,0,IF(AA51<1,0,AA51))","v":0},null,{"$f":"IF(X87=0,0,(VLOOKUP(M48,Tabel2[#All],6,FALSE)))","v":0},null,{"$f":"X87*Z87","v":0},null,{"$f":"IF($E$21=\"*\",0,AB87/(VLOOKUP($AD$86,Valutakurser,3,FALSE))*100)","v":0}]
[null,"Reduction in per diem over 28 days",null,null,null,null,null,null,null,null,null,null,null,null,null,null,null,null,null,null,null,null,null,{"$f":"IF(AI6<>1,0,IF(ISBLANK($M$48),0,IF($Z$88=0,0,IF(AA51>=28,AA51-28,0))))","v":0},null,{"$f":"IFERROR(IF($M$48=\"*\",0,-(VLOOKUP(AJ48,Data!A:G,7,FALSE))),0)","v":0},null,{"$f":"X88*Z88","v":0},null,0]
[null,"Meal deductions",null,null,{"$f":"Q60","v":"Breakfast"},null,null,null,null,null,null,null,null,null,null,null,null,null,null,null,null,null,null,{"$f":"IF($AI$6=1,T60,0)","v":0},null,{"$f":"IF(ISBLANK(Breakfastnumber),0,-15%)","v":0},null,{"$f":"IF(ISBLANK(X89),0,X89*Z89*$Z$87)","v":0},null,0]
[null,null,null,null,{"$f":"Q61","v":"Lunch"},null,null,null,null,null,null,null,null,null,null,null,null,null,null,null,null,null,null,{"$f":"IF($AI$6=1,T61,0)","v":0},null,{"$f":"IF(ISBLANK(Lunchnumber),0,-30%)","v":0},null,{"$f":"IF(ISBLANK(X90),0,X90*Z90*$Z$87)","v":0},null,0]
[null,null,null,null,{"$f":"Q62","v":"Dinner"},null,null,null,null,null,null,null,null,null,null,null,null,null,null,null,null,null,null,0,null,{"$f":"IF(ISBLANK(Dinnernumber),0,-30%)","v":0},null,0,null,0]
[null,{"$f":"G60","v":"Travel days at your own expense"},null,null,null,null,null,null,null,null,null,null,null,null,null,null,null,null,null,null,null,null,null,{"$f":"N60","v":0},null,{"$f":"IF(X92=0,0,-Z87)","v":0},null,{"$f":"X92*Z92","v":0},null,0]
[null,{"$f":"G56","v":"Days with undeclared accommodation"},null,null,null,null,null,null,null,null,null,null,null,null,null,null,null,null,null,null,null,null,null,{"$f":"N56","v":0},null,{"$f":"IF(N56=0,0,Data!O5)","v":0},null,{"$f":"X93*Z93","v":0},null,0]
[null,{"$f":"Q55","v":"Transportation in your own car"},null,null,null,null,null,null,null,null,null,null,null,null,null,null,null,null,null,null,null,null,null,{"$f":"Z58","v":0},null,{"$f":"IF(Z58=0,0,Data!O2)","v":0},null,{"$f":"X94*Z94","v":0},null,0]
[null,"Assessment fee",null,null,null,null,null,null,null,null,null,null,null,null,null,null,null,null,null,null,null,null,null,null,null,null,null,{"$f":"AB13","v":0},null,0]
[null,"Expenses as stated above",null,null,null,null,null,null,null,null,null,null,null,null,null,null,null,null,null,null,null,null,null,null,null,null,null,{"$f":"AB82","v":0},null,0]
[null,"Total",null,null,null,null,null,null,null,null,null,null,null,null,null,null,null,null,null,null,null,null,null,null,null,null,null,{"$f":"SUM(AB87:AC96)","v":0},null,{"$f":"SUM(AD87:AE96)","v":0}]
[]
[]
[null,"Grand total"]
[null,null,null,null,null,null,null,null,null,null,null,null,null,null,null,null,null,null,null,null,null,null,null,null,null,null,null,"DKK",null,{"$f":"IF(E21=\"*\",0,VLOOKUP(AI23,Data!A:E,3,FALSE))","v":0}]
[null,"Would you like a certain specification on your bank statement (max. 20 characters)",null,null,null,null,null,null,null,null,null,null,null,null,null,null,null,null,null,null,null,"Your payment (subject to approval)",null,null,null,null,null,{"$f":"AB97","v":0},null,{"$f":"AD97+AD13","v":0}]
[]
[]
[null,"For University of Copenhagen only",null,null,null,null,null,null,null,null,null,"Kontering, honorar",null,null,null,null,null,null,"Kontering, resten"]
[null,null,null,null,null,null,null,"Beløb i DKK:",null,null,null,"SLS-DLS",null,{"$f":"CONCATENATE(AI106,AJ106,AK106)","v":"28983300"},null,null,null,null,null,null,null,null,null,null,null,null,null,null,null,null,null,null,null,null,28983,{"$f":"IF(ISBLANK(N107),\"00\",LEFT(N107,2))","v":"30"},{"$f":"IF(ISBLANK(N110),\"0\",LEFT(N110,1))","v":"0"}]
[null,null,"Løndel",null,"6932/2236",null,null,null,null,null,null,"Sted",null,30387100,null,null,null,null,"Sted",null,{"$f":"N107","v":30387100}]
[null,null,"Løndel",null,9665,null,null,null,null,null,null,"Alias",null,1182781013,null,null,null,null,"Alias",null,{"$f":"N108","v":1182781013}]
[null,null,null,null,null,null,null,null,null,null,null,"Løngruppe",null,null,null,null,null,null,"Løngruppe",null,0]
[null,null,"10020000-615050-10-5000005010",null,null,null,null,null,null,null,null,"KU-DRS",null,null,null,null,null,null,"KU-DRS",null,0]
[null,null,"PKAT 780",null,null,null,null,null,null,null,null,"KU-spec.",null,null,null,null,null,null,"KU-spec.",null,0]
[null,null,null,null,null,null,null,null,null,null,null,null,null,{"$f":"IF(AD95=0,0,(AD95))","v":0},null,null,null,null,null,null,{"$f":"IF(AD102=0,0,(AD102-AD95))","v":0}]

{"sheet":"Data","index":1,"n_rows":205,"n_cols":20,"rows_kept":205,"cut":false,"hidden":true,"merged":[]}
["Country Code","Country Name","Prefered currency","Bank Category","IBAN length","Rate","Reduction","Kolonne1","Day","Month","Year","Travel year","Hour","Minute","kmrate","Currencies",null,"Kode","Valuta","Kurs"]
["*","*","*",null,null,null,0,null,"*","*","*","*","*","*",2.23,"*",null,"AUD","Australske dollar","451,71"]
["AD","Andorra ","EUR",2,24,487,0,null,"01","01","2014",2022,"00","00",null,"AUD",null,"CAD","Canadiske dollar","511,34"]
["AE","United Arab Emirates ","USD",2,23,487,0,null,"02","02","2013",2023,"01","15","Udok nat","CAD",null,"CHF","Schweiziske franc","769,78"]
["AF","Afghanistan ","USD",3,null,487,0,null,"03","03","2012",2024,"02","30",246,"CHF",null,"DKK","Danske kroner",100]
["AG","Antigua and Barbuda ","USD",3,null,487,0,null,"04","04","2011",2025,"03","45",null,"DKK",null,"EUR","Euro","746,15"]
["AL","Albania ","EUR",2,28,487,0,null,"05","05","2010",2025,"04",null,null,"EUR",null,"GBP","Britiske pund","864,32"]
["AM","Armenia ","EUR",3,null,487,0,null,"06","06","2009",2026,"05",null,null,"GBP",null,"JPY","Japanske yen","4,54"]
["AO","Angola ","USD",2,25,487,0,null,"07","07","2008",null,"06",null,null,"JPY",null,"NOK","Norske kroner","63,67"]
["AR","Argentina ","USD",3,null,487,0,null,"08","08","2007",null,"07",null,null,"NOK",null,"NZD","New Zealandske dollar","414,44"]
["AT","Austria ","EUR",2,20,487,0,null,"09","09","2006",null,"08",null,null,"NZD",null,"SEK","Svenske kroner","64,31"]
["AU","Australia ","AUD",5,null,487,0,null,"10","10","2005",null,"09",null,null,"SEK",null,"USD","Amerikanske dollar","701,8"]
["AZ","Azerbaijan ","EUR",2,28,487,0,null,"11","11","2004",null,"10",null,null,"USD"]
["BA","Bosnia and Herzegovina ","EUR",2,20,487,0,null,"12","12","2003",null,"11"]
["BB","Barbados ","USD",3,null,487,0,null,"13",null,"2002",null,"12"]
["BD","Bangladesh ","USD",3,null,370,0,null,"14",null,"2001",null,"13"]
["BE","Belgium ","EUR",2,16,487,0,null,"15",null,"2000",null,"14",null,null,"Mealreduc","Pct"]
["BF","Burkina Faso ","USD",2,27,487,0,null,"16",null,"1999",null,"15",null,null,"Breakfast",15]
["BG","Bulgaria ","EUR",2,22,363,0,null,"17",null,"1998",null,"16",null,null,"Lunch",30]
["BH","Bahrain ","USD",2,22,487,0,null,"18",null,"1997",null,"17",null,null,"Dinner",30]
["BI","Burundi ","USD",2,27,487,0,null,"19",null,"1996",null,"18"]
["BJ","Benin ","USD",2,28,487,0,null,"20",null,"1995",null,"19",null,null,"TD or not"]
["BN","Brunei Darussalam ","USD",3,null,487,0,null,"21",null,"1994",null,"20",null,null,"No"]
["BO","Bolivia ","USD",3,null,279,0,null,"22",null,"1993",null,"21"]
["BR","Brazil ","USD",2,29,487,0,null,"23",null,"1992",null,"22"]
["BS","Bahamas ","USD",3,null,487,0,null,"24",null,"1991",null,"23"]
["BT","Bhutan ","USD",3,null,203,0,null,"25",null,"1990"]
["BW","Botswana ","USD",3,null,487,0,null,"26",null,"1989"]
["BY","Belarus ","EUR",2,28,487,0,null,"27",null,"1988"]
["BZ","Belize ","USD",3,null,487,0,null,"28",null,"1987"]
["CA","Canada ","CAD",4,null,487,0,null,"29",null,"1986"]
["CD","Congo, Dem.Rep. ","USD",3,null,487,0,null,"30",null,"1985"]
["CF","Central African Republic ","USD",2,27,487,0,null,"31",null,"1984"]
["CG","Congo ","USD",2,27,487,0,null,null,null,"1983"]
["CH","Switzerland ","CHF",2,21,487,0,null,null,null,"1982"]
["CI","Côte d'Ivoire ","USD",2,28,487,0,null,null,null,"1981"]
["CL","Chile ","USD",3,null,487,0,null,null,null,"1980"]
["CM","Cameroon ","USD",2,27,487,0,null,null,null,"1979"]
["CN","China ","USD",3,null,487,0,null,null,null,"1978"]
["CO","Colombia ","USD",3,null,370,0,null,null,null,"1977"]
["CR","Costa Rica ","USD",2,22,487,0,null,null,null,"1976"]
["CU","Cuba ","USD",3,null,390,0,null,null,null,"1975"]
["CV","Cabo Verde ","USD",3,null,487,0,null,null,null,"1974"]
["CY","Cyprus ","EUR",2,28,487,0,null,null,null,"1973"]
["CZ","Czech Republic ","EUR",2,24,487,0,null,null,null,"1972"]
["DE","Germany ","EUR",2,22,487,0,null,null,null,"1971"]
["DJ","Djibouti ","USD",2,27,487,0,null,null,null,"1970"]
["DK","Denmark ","DKK",1,null,418,{"$f":"(1/4)*Tabel2[[#This Row],[Rate]]","v":104.5},null,null,null,"1969"]
["DM","Dominica ","USD",3,null,487,0,null,null,null,"1968"]
["DO","Dominican Republic ","USD",2,28,487,0,null,null,null,"1967"]
["DZ","Algeria ","USD",2,26,487,0,null,null,null,"1966"]
["EC","Ecuador ","USD",3,null,487,0,null,null,null,"1965"]
["EE","Estonia ","EUR",2,20,487,0,null,null,null,"1964"]
["EG","Egypt ","USD",2,29,373,0,null,null,null,"1963"]
["EH","Western Sahara ","USD",3,null,487,0,null,null,null,"1962"]
["ER","Eritrea ","USD",3,null,487,0,null,null,null,"1961"]
["ES","Spain ","EUR",2,24,487,0,null,null,null,"1960"]
["ET","Ethiopia ","USD",3,null,487,0,null,null,null,"1959"]
["FI","Finland ","EUR",2,18,487,0,null,null,null,"1958"]
["FJ","Fiji ","USD",3,null,487,0,null,null,null,"1957"]
["FM","Micronesia ","USD",3,null,487,0,null,null,null,"1956"]
["FO","Faroe Islands ","DKK",1,null,418,{"$f":"(1/6)*Tabel2[[#This Row],[Rate]]","v":69.666666666666657},null,null,null,"1955"]
["FR","France ","EUR",2,27,487,0,null,null,null,"1954"]
["GA","Gabon ","USD",2,27,487,0,null,null,null,"1953"]
["GB","United Kingdom ","GBP",2,22,487,0,null,null,null,"1952"]
["GD","Grenada ","USD",3,null,487,0,null,null,null,"1951"]
["GE","Georgia ","EUR",2,22,487,0,null,null,null,"1950"]
["GH","Ghana ","USD",3,null,487,0,null,null,null,"1949"]
["GL","Greenland ","DKK",1,null,487,0,null,null,null,"1948"]
["GM","Gambia ","USD",3,null,487,0,null,null,null,"1947"]
["GN","Guinea ","USD",3,null,487,0,null,null,null,"1946"]
["GQ","Equatorial Guinea ","USD",3,null,487,0,null,null,null,"1945"]
["GR","Greece ","EUR",2,27,487,0,null,null,null,"1944"]
["GT","Guatemala ","USD",2,28,487,0,null,null,null,"1943"]
["GW","Guinea-Bissau ","USD",3,null,487,0,null,null,null,"1942"]
["GY","Guyana ","USD",3,null,487,0,null,null,null,"1941"]
["HK","Hong Kong ","USD",3,null,487,0,null,null,null,"1940"]
["HN","Honduras ","USD",3,null,487,0,null,null,null,"1939"]
["HR","Croatia ","EUR",2,21,487,0,null,null,null,"1938"]
["HT","Haiti ","USD",3,null,487,0,null,null,null,"1937"]
["HU","Hungary ","EUR",2,28,487,0,null,null,null,"1936"]
["ID","Indonesia ","USD",3,null,487,0,null,null,null,"1935"]
["IE","Ireland ","EUR",2,22,487,0,null,null,null,"1934"]
["IL","Israel ","USD",2,23,487,0,null,null,null,"1933"]
["IN","India ","USD",3,null,269,0,null,null,null,"1932"]
["IQ","Iraq ","USD",2,23,487,0,null,null,null,"1931"]
["IR","Iran ","USD",2,26,279,0,null,null,null,"1930"]
["IS","Iceland ","EUR",2,26,487,0,null,null,null,"1929"]
["IT","Italy ","EUR",2,27,487,0,null,null,null,"1928"]
["JM","Jamaica ","USD",3,null,487,0,null,null,null,"1927"]
["JO","Jordan ","USD",2,30,487,0,null,null,null,"1926"]
["JP","Japan ","JPY",3,null,487,0,null,null,null,"1925"]
["KE","Kenya ","USD",3,null,487,0,null,null,null,"1924"]
["KG","Kyrgyzstan ","USD",3,null,487,0,null,null,null,"1923"]
["KH","Cambodia ","USD",3,null,487,0,null,null,null,"1922"]
["KI","Kiribati ","USD",3,null,487,0,null,null,null,"1921"]
["KM","Comoros ","USD",3,null,487,0,null,null,null,"1920"]
["KN","Saint Kitts and Nevis ","USD",3,null,487,0,null,null,null,"1919"]
["KP","North Korea ","USD",3,null,487,0,null,null,null,"1918"]
["KR","South Korea ","USD",3,null,487,0,null,null,null,"1917"]
["KW","Kuwait ","USD",2,30,487,0,null,null,null,"1916"]
["KZ","Kazakhstan ","USD",2,20,487,0,null,null,null,"1915"]
["LA","Laos ","USD",3,null,487,0]
["LB","Lebanon ","USD",2,28,487,0]
["LC","Saint Lucia ","USD",2,32,487,0]
["LI","Liechtenstein ","EUR",2,21,487,0]
["LK","Sri Lanka ","USD",3,null,487,0]
["LR","Liberia ","USD",3,null,487,0]
["LS","Lesotho ","USD",3,null,487,0]
["LT","Lithuania ","EUR",2,20,487,0]
["LU","Luxembourg ","EUR",2,20,487,0]
["LV","Latvia ","EUR",2,21,487,0]
["LY","Libya ","USD",2,25,487,0]
["MA","Morocco ","USD",3,null,487,0]
["MC","Monaco ","EUR",2,27,487,0]
["MD","Moldova","EUR",2,24,487,0]
["ME","Montenegro ","EUR",2,22,487,0]
["MG","Madagascar ","USD",2,27,487,0]
["MH","Marshall Islands ","USD",3,null,487,0]
["MK","Macedonia ","EUR",2,19,487,0]
{"$rows_left_out":85}